BDBM50348106 CHEMBL1800431
SMILES CN1CCc2ccc(cc2C1)C#Cc1ccc2c(Cl)c(CN)sc2c1
InChI Key InChIKey=GIVUPRNLMTVSBP-UHFFFAOYSA-N
Data  1 IC50
  Tab Delimited (TSV)   2D SDfile   Computed 3D by Vconf -m prep SDfile
Find this compound or compounds like it in BindingDB:
Activity Spreadsheet -- Enzyme Inhibition Constant Data from BindingDB
Found 1 hit for monomerid = 50348106
TargetAcid-sensing ion channel 3(Homo sapiens (Human))
Merck Research Laboratories
Curated by ChEMBL
LigandPNGBDBM50348106(CHEMBL1800431)
Affinity DataIC50:  680nM. Assay description: Inhibition of ASIC3 assessed as inhibition of peak current by electrophysiology method
In DepthDetails ArticlePubMed