BDBM50348420 CHEMBL1800951
SMILES CN(C)S(=O)(=O)N1CC[C@H](C1)Oc1cc(F)cc(NC(=O)Nc2cccnc2)c1
InChI Key InChIKey=JWUMEUQKWJCDSW-MRXNPFEDSA-N
Data  1 IC50
  Tab Delimited (TSV)   2D SDfile   Computed 3D by Vconf -m prep SDfile
Find this compound or compounds like it in BindingDB:
Activity Spreadsheet -- Enzyme Inhibition Constant Data from BindingDB
Found 1 hit for monomerid = 50348420
TargetCytochrome P450 1A2(Homo sapiens (Human))
TBA
Curated by ChEMBL
LigandPNGBDBM50348420(CHEMBL1800951)
Affinity DataIC50:  60nM. Assay description: Inhibition of CYP1A2
In DepthDetails ArticlePubMed