BDBM50349649 CHEMBL1809008
SMILES O=C(Nc1ccccc1)N1C[C@@H](C=C2[C@H]1Cc1c[nH]c3cccc2c13)C(=O)N1CCOCC1
InChI Key InChIKey=YLMYBTJRYYSEKF-WZONZLPQSA-N
Data  4 IC50
  Tab Delimited (TSV)   2D SDfile   Computed 3D by Vconf -m prep SDfile
Find this compound or compounds like it in BindingDB:
Activity Spreadsheet -- Enzyme Inhibition Constant Data from BindingDB
Found 4 hits for monomerid = 50349649
TargetC-X-C chemokine receptor type 3(Homo sapiens (Human))
Novartis Institutes For Biomedical Research
Curated by ChEMBL
LigandPNGBDBM50349649(CHEMBL1809008)
Affinity DataIC50:  22nM. Assay description: Displacement of radiolabeled CXCL11 from human CXCR3 expressed in CHO cells by scintillation proximity assay
In DepthDetails ArticlePubMed
TargetC-X-C chemokine receptor type 3(Rattus norvegicus)
Novartis Institutes For Biomedical Research
Curated by ChEMBL
LigandPNGBDBM50349649(CHEMBL1809008)
Affinity DataIC50:  78nM. Assay description: Antagonist activity at CXCR3 in rat leukocytes assessed as inhibition of ITAC-induced cell migration by flow cytometry
In DepthDetails ArticlePubMed
TargetC-X-C chemokine receptor type 3(Mus musculus)
Novartis Institutes For Biomedical Research
Curated by ChEMBL
LigandPNGBDBM50349649(CHEMBL1809008)
Affinity DataIC50:  12nM. Assay description: Antagonist activity at mouse CXCR3 expressed in mouse L1.2 cells assessed as inhibition of ITAC-induced calcium mobilization by FLIPR assay
In DepthDetails ArticlePubMed
TargetC-X-C chemokine receptor type 3(Homo sapiens (Human))
Novartis Institutes For Biomedical Research
Curated by ChEMBL
LigandPNGBDBM50349649(CHEMBL1809008)
Affinity DataIC50:  16nM. Assay description: Antagonist activity at human CXCR3 expressed in mouse L1.2 cells assessed as inhibition of ITAC-induced calcium mobilization by FLIPR assay
In DepthDetails ArticlePubMed