BDBM50351401 CHEMBL1819091
SMILES CC[C@@]1(N)CCCN(C1)c1cc2n(C)c(=O)n(C)c(=O)c2n1Cc1cc(F)ccc1C#N
InChI Key InChIKey=PNCYZOJJIHDBQW-HSZRJFAPSA-N
Data  1 KI  1 IC50
  Tab Delimited (TSV)   2D SDfile   Computed 3D by Vconf -m prep SDfile
Find this compound or compounds like it in BindingDB:
Activity Spreadsheet -- Enzyme Inhibition Constant Data from BindingDB
Found 2 hits for monomerid = 50351401
TargetCytochrome P450 3A4(Homo sapiens (Human))
Dainippon Sumitomo Pharma
Curated by ChEMBL
LigandPNGBDBM50351401(CHEMBL1819091)
Affinity DataKi:  0.0220nM. Assay description: Inhibition of CYP3A4 in human liver microsomes pre-incubated for 15 mins by LC/MS/MS analysis
In DepthDetails ArticlePubMed
TargetDipeptidyl peptidase 4(Homo sapiens (Human))
Dainippon Sumitomo Pharma
Curated by ChEMBL
LigandPNGBDBM50351401(CHEMBL1819091)
Affinity DataIC50:  26nM. Assay description: Inhibition of DPP4 in human plasma assessed as formation of 7-amino-4-methylcoumarin from glycyl-L-proline 4-methylcoumaryl-7-amide by fluorescence a...
In DepthDetails ArticlePubMed