BDBM50354072 CHEMBL1836317
SMILES CS(=O)(=O)NC[C@H]1CC[C@@H](CC1)Nc1nc-2c(CCSc3ccccc-23)s1
InChI Key InChIKey=UWSBTSAJZMIHBL-HDJSIYSDSA-N
Data  4 KI  10 IC50
  Tab Delimited (TSV)   2D SDfile   Computed 3D by Vconf -m prep SDfile
Find this compound or compounds like it in BindingDB:
Activity Spreadsheet -- Enzyme Inhibition Constant Data from BindingDB
Found 14 hits for monomerid = 50354072
TargetNeuropeptide Y receptor type 5(Rat 6B)
Lundbeck Research Usa
Curated by ChEMBL
LigandPNGBDBM50354072(CHEMBL1836317)
Affinity DataKi:  1.40nM. Assay description: Antagonist activity at rat NPY5 receptor
In DepthDetails ArticlePubMed
TargetNeuropeptide Y receptor type 5(Homo sapiens (Human))
Lundbeck Research Usa
Curated by ChEMBL
LigandPNGBDBM50354072(CHEMBL1836317)
Affinity DataKi:  1.5nM. Assay description: Antagonist activity at human NPY5 receptor assessed as calcium mobilization by FLIPR assay
In DepthDetails ArticlePubMed
Target5-hydroxytryptamine receptor 2B(Homo sapiens (Human))
Lundbeck Research Usa
Curated by ChEMBL
LigandPNGBDBM50354072(CHEMBL1836317)
Affinity DataKi:  245nM. Assay description: Binding affinity to human 5HT2B receptor
In DepthDetails ArticlePubMed
Target5-hydroxytryptamine receptor 1A(Homo sapiens (Human))
Lundbeck Research Usa
Curated by ChEMBL
LigandPNGBDBM50354072(CHEMBL1836317)
Affinity DataKi:  478nM. Assay description: Binding affinity to human 5HT1A receptor
In DepthDetails ArticlePubMed
TargetCytochrome P450 2C19(Homo sapiens (Human))
Lundbeck Research Usa
Curated by ChEMBL
LigandPNGBDBM50354072(CHEMBL1836317)
Affinity DataIC50: >1.00E+4nM. Assay description: Inhibition of CYP2C19
In DepthDetails ArticlePubMed
TargetCytochrome P450 2C9(Homo sapiens (Human))
Lundbeck Research Usa
Curated by ChEMBL
LigandPNGBDBM50354072(CHEMBL1836317)
Affinity DataIC50: >1.00E+4nM. Assay description: Inhibition of CYP2C9
In DepthDetails ArticlePubMed
TargetCytochrome P450 1A2(Homo sapiens (Human))
Lundbeck Research Usa
Curated by ChEMBL
LigandPNGBDBM50354072(CHEMBL1836317)
Affinity DataIC50: >1.00E+4nM. Assay description: Inhibition of CYP1A2
In DepthDetails ArticlePubMed
TargetCytochrome P450 3A4(Homo sapiens (Human))
Lundbeck Research Usa
Curated by ChEMBL
LigandPNGBDBM50354072(CHEMBL1836317)
Affinity DataIC50:  4.10E+3nM. Assay description: Inhibition of CYP3A4
In DepthDetails ArticlePubMed
TargetPotassium voltage-gated channel subfamily H member 2(Homo sapiens (Human))
Lundbeck Research Usa
Curated by ChEMBL
LigandPNGBDBM50354072(CHEMBL1836317)
Affinity DataIC50: >1.00E+4nM. Assay description: Inhibition of human ERG by patch-clamp assay
In DepthDetails ArticlePubMed
TargetNeuropeptide Y receptor type 4(Homo sapiens (Human))
Lundbeck Research Usa
Curated by ChEMBL
LigandPNGBDBM50354072(CHEMBL1836317)
Affinity DataIC50: >1.00E+3nM. Assay description: Antagonist activity at human NPY4 receptor assessed as calcium mobilization by FLIPR assay
In DepthDetails ArticlePubMed
TargetNeuropeptide Y receptor type 2(Homo sapiens (Human))
Lundbeck Research Usa
Curated by ChEMBL
LigandPNGBDBM50354072(CHEMBL1836317)
Affinity DataIC50: >1.00E+3nM. Assay description: Antagonist activity at human NPY2 receptor assessed as calcium mobilization by FLIPR assay
In DepthDetails ArticlePubMed
TargetNeuropeptide Y receptor type 1(Homo sapiens (Human))
Lundbeck Research Usa
Curated by ChEMBL
LigandPNGBDBM50354072(CHEMBL1836317)
Affinity DataIC50: >1.00E+3nM. Assay description: Antagonist activity at human NPY1 receptor assessed as calcium mobilization by FLIPR assay
In DepthDetails ArticlePubMed
TargetNeuropeptide Y receptor type 5(Homo sapiens (Human))
Lundbeck Research Usa
Curated by ChEMBL
LigandPNGBDBM50354072(CHEMBL1836317)
Affinity DataIC50:  1.80nM. Assay description: Antagonist activity at human NPY5 receptor assessed as calcium mobilization by FLIPR assay
In DepthDetails ArticlePubMed
TargetCytochrome P450 2D6(Homo sapiens (Human))
Lundbeck Research Usa
Curated by ChEMBL
LigandPNGBDBM50354072(CHEMBL1836317)
Affinity DataIC50: >1.00E+4nM. Assay description: Inhibition of CYP2D6
In DepthDetails ArticlePubMed