BDBM50354204 CHEMBL1835998
SMILES CC(C)N1CC[C@H](C1)N(C)C(=O)c1ccc(cc1)-n1cccn1
InChI Key InChIKey=DLLDFEGVGAAWNL-QGZVFWFLSA-N
Data  1 KI
  Tab Delimited (TSV)   2D SDfile   Computed 3D by Vconf -m prep SDfile
Find this compound or compounds like it in BindingDB:
Activity Spreadsheet -- Enzyme Inhibition Constant Data from BindingDB
Found 1 hit for monomerid = 50354204
TargetHistamine H3 receptor(Homo sapiens (Human))
Pfizer
Curated by ChEMBL
LigandPNGBDBM50354204(CHEMBL1835998)
Affinity DataKi:  7nM. Assay description: Displacement of [3H]-(R)alpha-methylhistamine from human histamine H3 receptor expressed in human HEK293T cells
In DepthDetails ArticlePubMed