BDBM50355322 CHEMBL1835227
SMILES Cc1ccc(cc1)-c1cc2cc(OC3CCCC3)ccc2oc1=O
InChI Key InChIKey=KVRCSMCDZXYFSM-UHFFFAOYSA-N
Data  1 IC50
  Tab Delimited (TSV)   2D SDfile   Computed 3D by Vconf -m prep SDfile
Find this compound or compounds like it in BindingDB:
Activity Spreadsheet -- Enzyme Inhibition Constant Data from BindingDB
Found 1 hit for monomerid = 50355322
TargetAmine oxidase [flavin-containing] B(Homo sapiens (Human))
University Of Santiago De Compostela
Curated by ChEMBL
LigandPNGBDBM50355322(CHEMBL1835227)
Affinity DataIC50:  1.45E+4nM. Assay description: Inhibition of human recombinant MAO-B expressed in insect BT1-TN-5B1-4 cells assessed as production of hydrogen peroxide from p-tyramine up to 15 min...
In DepthDetails ArticlePubMed