BDBM50356160 CHEMBL1909930
SMILES CC(C)c1cccc2cc[n+](C)c(CCCCCc3[n+](C)ccc4cccc(C(C)C)c34)c12
InChI Key InChIKey=RKARHHCCHCTCIN-UHFFFAOYSA-N
Data  2 KI
  Tab Delimited (TSV)   2D SDfile   Computed 3D by Vconf -m prep SDfile
Find this compound or compounds like it in BindingDB:
Activity Spreadsheet -- Enzyme Inhibition Constant Data from BindingDB
Found 2 hits for monomerid = 50356160
TargetSmall conductance calcium-activated potassium channel protein 3(Homo sapiens (Human))
University Of Li£Ge
Curated by ChEMBL
LigandPNGBDBM50356160(CHEMBL1909930)
Affinity DataKi:  575nM. Assay description: Displacement of [125I]-apamin from cloned SK3 channel expressed in human HEK293 cells after 1 hr by liquid scintillation counting
In DepthDetails ArticlePubMed
TargetSmall conductance calcium-activated potassium channel protein 2(Homo sapiens (Human))
University Of Li£Ge
Curated by ChEMBL
LigandPNGBDBM50356160(CHEMBL1909930)
Affinity DataKi:  878nM. Assay description: Displacement of [125I]-apamin from cloned SK2 channel expressed in human HEK293 cells after 1 hr by liquid scintillation counting
In DepthDetails ArticlePubMed