BDBM50357479 CHEMBL1917910
SMILES CCCN(CCC)C(=O)c1cccc(c1)C(=O)N[C@@H](Cc1cc(F)cc(F)c1)[C@H](O)[C@H]1Cc2ccccc2CN1
InChI Key InChIKey=OAYGVALPPHEIOB-DYIKCSJPSA-N
Data  1 IC50
  Tab Delimited (TSV)   2D SDfile   Computed 3D by Vconf -m prep SDfile
Find this compound or compounds like it in BindingDB:
Activity Spreadsheet -- Enzyme Inhibition Constant Data from BindingDB
Found 1 hit for monomerid = 50357479
TargetBeta-secretase 1(Homo sapiens (Human))
Bristol-Myers Squibb Research And Development
Curated by ChEMBL
LigandPNGBDBM50357479(CHEMBL1917910)
Affinity DataIC50:  1.10E+3nM. Assay description: Inhibition of BACE-1
In DepthDetails ArticlePubMed