BDBM50357977 CHEMBL1917343
SMILES COc1ccccc1N1CCN(CCCCNS(=O)(=O)c2ccc3ncccc3c2)CC1
InChI Key InChIKey=LWWMFNNSDONGNR-UHFFFAOYSA-N
Data  2 KI
  Tab Delimited (TSV)   2D SDfile   Computed 3D by Vconf -m prep SDfile
Find this compound or compounds like it in BindingDB:
Activity Spreadsheet -- Enzyme Inhibition Constant Data from BindingDB
Found 2 hits for monomerid = 50357977
Target5-hydroxytryptamine receptor 1A(Rattus norvegicus (rat))
Jagiellonian University Medical College
Curated by ChEMBL
LigandPNGBDBM50357977(CHEMBL1917343)
Affinity DataKi:  40nM. Assay description: Displacement of [3H]-8-OH-DPAT from 5-HT1A receptor in rat hippocampus by liquid scintillation counting
In DepthDetails ArticlePubMed
Target5-hydroxytryptamine receptor 7(Homo sapiens (Human))
Jagiellonian University Medical College
Curated by ChEMBL
LigandPNGBDBM50357977(CHEMBL1917343)
Affinity DataKi:  132nM. Assay description: Displacement of [3H]-5-CT from human 5-HT7 receptor expressed in HEK293 cells after 1 hr by liquid scintillation counting
In DepthDetails ArticlePubMed