BDBM50358503 CHEMBL1923210
SMILES COc1ccc(Oc2cc(Nc3cc(Cl)ccc3C(N)=O)c(cn2)C(F)(F)F)cc1
InChI Key InChIKey=UNYBVPZZEAKQRB-UHFFFAOYSA-N
Data  1 IC50
  Tab Delimited (TSV)   2D SDfile   Computed 3D by Vconf -m prep SDfile
Find this compound or compounds like it in BindingDB:
Activity Spreadsheet -- Enzyme Inhibition Constant Data from BindingDB
Found 1 hit for monomerid = 50358503
TargetMitogen-activated protein kinase 10(Homo sapiens (Human))
The Scripps Research Institute
Curated by ChEMBL
LigandPNGBDBM50358503(CHEMBL1923210)
Affinity DataIC50:  78nM. Assay description: Inhibition of JNK3 using biotinylated-ATF2 as substrate by HTRF assay
In DepthDetails ArticlePubMed