BDBM50358510 CHEMBL1923203
SMILES NC(=O)c1ccccc1Nc1cc(Oc2ccc(cc2)N2CCNCC2)ncc1C(F)(F)F
InChI Key InChIKey=QSCQLHKHLCTFFF-UHFFFAOYSA-N
Data  1 IC50
  Tab Delimited (TSV)   2D SDfile   Computed 3D by Vconf -m prep SDfile
Find this compound or compounds like it in BindingDB:
Activity Spreadsheet -- Enzyme Inhibition Constant Data from BindingDB
Found 1 hit for monomerid = 50358510
TargetMitogen-activated protein kinase 10(Homo sapiens (Human))
The Scripps Research Institute
Curated by ChEMBL
LigandPNGBDBM50358510(CHEMBL1923203)
Affinity DataIC50:  34nM. Assay description: Inhibition of JNK3 using biotinylated-ATF2 as substrate by HTRF assay
In DepthDetails ArticlePubMed