BDBM50358516 CHEMBL1921815
SMILES NC(=O)c1ccccc1Nc1cc(Oc2ccc(Cl)c(Cl)c2)ncc1C(F)(F)F
InChI Key InChIKey=RXFZUHJHYNKIJF-UHFFFAOYSA-N
Data  2 IC50
  Tab Delimited (TSV)   2D SDfile   Computed 3D by Vconf -m prep SDfile
Find this compound or compounds like it in BindingDB:
Activity Spreadsheet -- Enzyme Inhibition Constant Data from BindingDB
Found 2 hits for monomerid = 50358516
TargetMitogen-activated protein kinase 8(Homo sapiens (Human))
The Scripps Research Institute
Curated by ChEMBL
LigandPNGBDBM50358516(CHEMBL1921815)
Affinity DataIC50:  680nM. Assay description: Inhibition of JNK1 using biotinylated-ATF2 as substrate by HTRF assay
In DepthDetails ArticlePubMed
TargetMitogen-activated protein kinase 10(Homo sapiens (Human))
The Scripps Research Institute
Curated by ChEMBL
LigandPNGBDBM50358516(CHEMBL1921815)
Affinity DataIC50:  100nM. Assay description: Inhibition of JNK3 using biotinylated-ATF2 as substrate by HTRF assay
In DepthDetails ArticlePubMed