BDBM50358525 CHEMBL1923189
SMILES COc1cccc(Oc2cc(Nc3ccccc3C(N)=O)c(cn2)C(F)(F)F)c1
InChI Key InChIKey=CUABCZMVBDQUGO-UHFFFAOYSA-N
Data  2 IC50
  Tab Delimited (TSV)   2D SDfile   Computed 3D by Vconf -m prep SDfile
Find this compound or compounds like it in BindingDB:
Activity Spreadsheet -- Enzyme Inhibition Constant Data from BindingDB
Found 2 hits for monomerid = 50358525
TargetMitogen-activated protein kinase 8(Homo sapiens (Human))
The Scripps Research Institute
Curated by ChEMBL
LigandPNGBDBM50358525(CHEMBL1923189)
Affinity DataIC50:  38nM. Assay description: Inhibition of JNK1 using biotinylated-ATF2 as substrate by HTRF assay
In DepthDetails ArticlePubMed
TargetMitogen-activated protein kinase 10(Homo sapiens (Human))
The Scripps Research Institute
Curated by ChEMBL
LigandPNGBDBM50358525(CHEMBL1923189)
Affinity DataIC50:  70nM. Assay description: Inhibition of JNK3 using biotinylated-ATF2 as substrate by HTRF assay
In DepthDetails ArticlePubMed