BDBM50358753 CHEMBL1922272
SMILES O=Cc1ccc(cc1)-c1cccs1
InChI Key InChIKey=UECDQUOWFRTJOH-UHFFFAOYSA-N
Data  1 IC50
  Tab Delimited (TSV)   2D SDfile   Computed 3D by Vconf -m prep SDfile
Find this compound or compounds like it in BindingDB:
Activity Spreadsheet -- Enzyme Inhibition Constant Data from BindingDB
Found 1 hit for monomerid = 50358753
TargetCytochrome P450 2A6(Homo sapiens (Human))
University Of Eastern Finland
Curated by ChEMBL
LigandPNGBDBM50358753(CHEMBL1922272)
Affinity DataIC50: >1.00E+5nM. Assay description: Inhibition of CYP2A6 in human liver microsomes assessed as inhibition of coumarin 7-hydroxylation after 10 mins by plate reader
In DepthDetails ArticlePubMed