BDBM50359598 CHEMBL1927873
SMILES Fc1ccc(cc1)C(OC\C=C1\C[C@@H]2CC[C@H](C1)N2CC=C)c1ccc(F)cc1
InChI Key InChIKey=RQAXYGUBABXSAE-WIOQJERESA-N
Data  3 KI
  Tab Delimited (TSV)   2D SDfile   Computed 3D by Vconf -m prep SDfile
Find this compound or compounds like it in BindingDB:
Activity Spreadsheet -- Enzyme Inhibition Constant Data from BindingDB
Found 3 hits for monomerid = 50359598
TargetSodium-dependent dopamine transporter(Rattus norvegicus (rat))
University Of New Orleans
Curated by ChEMBL
LigandPNGBDBM50359598(CHEMBL1927873)
Affinity DataKi:  21nM. Assay description: Displacement of [3H]WIN35428 from DAT in Sprague-Dawley rat brain homogenates after 1 hr by scintillation counting
In DepthDetails ArticlePubMed
TargetTransporter(Rattus norvegicus (rat))
University Of New Orleans
Curated by ChEMBL
LigandPNGBDBM50359598(CHEMBL1927873)
Affinity DataKi:  3.12E+3nM. Assay description: Displacement of [3H]nisoxetine from NET in Sprague-Dawley rat brain cortex membranes after 1 hr
In DepthDetails ArticlePubMed
TargetSodium-dependent serotonin transporter(Rattus norvegicus (rat))
University Of New Orleans
Curated by ChEMBL
LigandPNGBDBM50359598(CHEMBL1927873)
Affinity DataKi:  3.46E+3nM. Assay description: Displacement of [3H]citalopram from SERT in Sprague-Dawley rat brain homogenates after 60 mins by liquid scintillation counting
In DepthDetails ArticlePubMed