BDBM50359608 CHEMBL1927861
SMILES CN1[C@H]2CC[C@@H]1C\C(C2)=C/COC(c1ccc(F)cc1)c1ccc(F)cc1
InChI Key InChIKey=OCVGKOKAQNBCSV-BUQGTCPTSA-N
Data  1 KI
  Tab Delimited (TSV)   2D SDfile   Computed 3D by Vconf -m prep SDfile
Find this compound or compounds like it in BindingDB:
Activity Spreadsheet -- Enzyme Inhibition Constant Data from BindingDB
Found 1 hit for monomerid = 50359608
TargetSodium-dependent dopamine transporter(Rattus norvegicus (rat))
University Of New Orleans
Curated by ChEMBL
LigandPNGBDBM50359608(CHEMBL1927861)
Affinity DataKi:  19nM. Assay description: Displacement of [3H]WIN35428 from DAT in Sprague-Dawley rat brain homogenates after 1 hr by scintillation counting
In DepthDetails ArticlePubMed