BDBM50359611 CHEMBL1927870
SMILES CCCN1[C@H]2CC[C@@H]1C\C(C2)=C/COC(c1ccccc1)c1ccccc1
InChI Key InChIKey=MLWQUJZYYJILHS-KRSLBFQESA-N
Data  1 KI
  Tab Delimited (TSV)   2D SDfile   Computed 3D by Vconf -m prep SDfile
Find this compound or compounds like it in BindingDB:
Activity Spreadsheet -- Enzyme Inhibition Constant Data from BindingDB
Found 1 hit for monomerid = 50359611
TargetSodium-dependent dopamine transporter(Rattus norvegicus (rat))
University Of New Orleans
Curated by ChEMBL
LigandPNGBDBM50359611(CHEMBL1927870)
Affinity DataKi:  245nM. Assay description: Displacement of [3H]WIN35428 from DAT in Sprague-Dawley rat brain homogenates after 1 hr by scintillation counting
In DepthDetails ArticlePubMed