BDBM50359676 CHEMBL1929265
SMILES CCCc1ccccc1NC(=O)[C@H](C)NC(=O)c1ccc(C=C2SC(S)=NC2=O)cc1
InChI Key InChIKey=JZTQQHWVMVBCIQ-AWEZNQCLSA-N
Data  1 IC50
  Tab Delimited (TSV)   2D SDfile   Computed 3D by Vconf -m prep SDfile
Find this compound or compounds like it in BindingDB:
Activity Spreadsheet -- Enzyme Inhibition Constant Data from BindingDB
Found 1 hit for monomerid = 50359676
TargetAcetylcholinesterase(Electrophorus electricus (Electric eel))
The University Of Adelaide
Curated by ChEMBL
LigandPNGBDBM50359676(CHEMBL1929265)
Affinity DataIC50: >1.00E+5nM. Assay description: Inhibition of Electrophorus electricus acetylcholinesterase preincubated for 15 mins by spectrophotometry
In DepthDetails ArticlePubMed