BDBM50359756 CHEMBL1928138
SMILES COc1ccccc1N1CCN(CCCNC(=O)c2cnn3ccc(COCCOCCOCCOCCOCc4ccn5ncc(C(=O)NCCCN6CCN(CC6)c6ccccc6OC)c5c4)cc23)CC1
InChI Key InChIKey=YOPFVVBZYPEBHX-UHFFFAOYSA-N
Data  5 KI
  Tab Delimited (TSV)   2D SDfile   Computed 3D by Vconf -m prep SDfile
Find this compound or compounds like it in BindingDB:
Activity Spreadsheet -- Enzyme Inhibition Constant Data from BindingDB
Found 5 hits for monomerid = 50359756
TargetAlpha-1A adrenergic receptor(Sus scrofa)
Friedrich-Alexander University
Curated by ChEMBL
LigandPNGBDBM50359756(CHEMBL1928138)
Affinity DataKi:  3.5nM. Assay description: Displacement of [3H]prazosin from pig adrenergic alpha1 receptor in cerebral cortex homogenate
In DepthDetails ArticlePubMed
TargetD(2) dopamine receptor(Homo sapiens (Human))
Friedrich-Alexander University
Curated by ChEMBL
LigandPNGBDBM50359756(CHEMBL1928138)
Affinity DataKi:  3.90nM. Assay description: Displacement of [3H]spiperone from human D2 short receptor expressed in CHO cells
In DepthDetails ArticlePubMed
TargetD(2) dopamine receptor(Homo sapiens (Human))
Friedrich-Alexander University
Curated by ChEMBL
LigandPNGBDBM50359756(CHEMBL1928138)
Affinity DataKi:  4.70nM. Assay description: Displacement of [3H]spiperone from human D2 long receptor expressed in CHO cells
In DepthDetails ArticlePubMed
TargetD(3) dopamine receptor(Homo sapiens (Human))
Friedrich-Alexander University
Curated by ChEMBL
LigandPNGBDBM50359756(CHEMBL1928138)
Affinity DataKi:  10nM. Assay description: Displacement of [3H]spiperone from human D3 receptor expressed in CHO cells
In DepthDetails ArticlePubMed
TargetD(1A) dopamine receptor(Sus scrofa)
Friedrich-Alexander University
Curated by ChEMBL
LigandPNGBDBM50359756(CHEMBL1928138)
Affinity DataKi:  740nM. Assay description: Displacement of [3H]SCH23390 from pig D1 receptor in straital membrane
In DepthDetails ArticlePubMed