BDBM50360503 CHEMBL1935211
SMILES COc1ccc(\C=C\C(=O)c2ccc3ccccc3c2O)cc1OC
InChI Key InChIKey=AOXZKEBKRSOYMQ-YRNVUSSQSA-N
Data  2 IC50
  Tab Delimited (TSV)   2D SDfile   Computed 3D by Vconf -m prep SDfile
Find this compound or compounds like it in BindingDB:
Activity Spreadsheet -- Enzyme Inhibition Constant Data from BindingDB
Found 2 hits for monomerid = 50360503
TargetBroad substrate specificity ATP-binding cassette transporter ABCG2(Homo sapiens (Human))
University Of Bonn
Curated by ChEMBL
LigandPNGBDBM50360503(CHEMBL1935211)
Affinity DataIC50:  1.95E+3nM. Assay description: Inhibition of human BCRP expressed in MDCK2 cells assessed as Hoechst 33342 accumulation preincubated for 30 mins by fluorimetry
In DepthDetails ArticlePubMed
TargetBroad substrate specificity ATP-binding cassette transporter ABCG2(Homo sapiens (Human))
University Of Bonn
Curated by ChEMBL
LigandPNGBDBM50360503(CHEMBL1935211)
Affinity DataIC50:  2.50E+3nM. Assay description: Inhibition of BCRP in human MCF7/MX cells assessed as Hoechst 33342 accumulation preincubated for 30 mins by Fluorometry
In DepthDetails ArticlePubMed