BDBM50360543 CHEMBL1933156
SMILES Clc1ccc(OCCOc2ccc(C=O)nc2I)c(Cl)c1
InChI Key InChIKey=PVBPWUVLGXTGGD-UHFFFAOYSA-N
Data  1 EC50
  Tab Delimited (TSV)   2D SDfile   Computed 3D by Vconf -m prep SDfile
Find this compound or compounds like it in BindingDB:
Activity Spreadsheet -- Enzyme Inhibition Constant Data from BindingDB
Found 1 hit for monomerid = 50360543
TargetSphingosine 1-phosphate receptor 4(Homo sapiens (Human))
The Scripps Research Institute
Curated by ChEMBL
LigandPNGBDBM50360543(CHEMBL1933156)
Affinity DataEC50:  2.10E+3nM. Assay description: Agonist activity at human S1P4R expressed in human U2OS cells containing EDG6 gene co-expressing GAL4-VP16 and beta-arrestin/TEV protease assessed as...
In DepthDetails ArticlePubMed