BDBM50361332 CHEMBL1933420
SMILES CCCCCCCCCCCC(=O)c1c(C)c(CCC(=O)NS(C)(=O)=O)n(C)c1C
InChI Key InChIKey=IAEVMTSLPSOKNP-UHFFFAOYSA-N
Data  1 IC50
  Tab Delimited (TSV)   2D SDfile   Computed 3D by Vconf -m prep SDfile
Find this compound or compounds like it in BindingDB:
Activity Spreadsheet -- Enzyme Inhibition Constant Data from BindingDB
Found 1 hit for monomerid = 50361332
TargetProstaglandin E synthase(Homo sapiens (Human))
University Of M£Nster
Curated by ChEMBL
LigandPNGBDBM50361332(CHEMBL1933420)
Affinity DataIC50:  600nM. Assay description: Inhibition of human recombinant mPGES-1 in assessed as conversion of PGH2 into PGE2 at 20 degC after 5 mins by HPLC-UV analysis
In DepthDetails ArticlePubMed