BDBM50361539 CHEMBL1938913
SMILES CN1CCOc2ccc(cc12)S(=O)(=O)Nc1ccc(C)c(C)c1
InChI Key InChIKey=XSYIXQCKAKFZHD-UHFFFAOYSA-N
Data  1 EC50
  Tab Delimited (TSV)   2D SDfile   Computed 3D by Vconf -m prep SDfile
Find this compound or compounds like it in BindingDB:
Activity Spreadsheet -- Enzyme Inhibition Constant Data from BindingDB
Found 1 hit for monomerid = 50361539
TargetPyruvate kinase PKM(Homo sapiens (Human))
National Human Genome Research Institute
Curated by ChEMBL
LigandPNGBDBM50361539(CHEMBL1938913)
Affinity DataEC50:  6.00E+3nM. Assay description: Activation of human PKM2 assessed as ATP product formation after 1 hr by luminescent pyruvate kinase-luciferase coupled assay
In DepthDetails ArticlePubMed