BDBM50362007 CHEMBL1939715
SMILES C[N+](C)(CC[C@H](N)C(=O)NCc1ccc(CNC(=O)[C@@H](N)CC[N+](C)(C)C[C@H]2O[C@H]([C@H](O)[C@@H]2O)n2cnc3c(N)ncnc23)cc1)C[C@H]1O[C@H]([C@H](O)[C@@H]1O)n1cnc2c(N)ncnc12
InChI Key InChIKey=CIKHPSDRFNMMRL-LZFDDTNSSA-P
Data  1 EC50
  Tab Delimited (TSV)   2D SDfile   Computed 3D by Vconf -m prep SDfile
Find this compound or compounds like it in BindingDB:
Activity Spreadsheet -- Enzyme Inhibition Constant Data from BindingDB
Found 1 hit for monomerid = 50362007
TargetMet repressor(Escherichia coli)
University Of Leeds
Curated by ChEMBL
LigandPNGBDBM50362007(CHEMBL1939715)
Affinity DataEC50:  15nM. Assay description: Binding affinity to Escherichia coli metJ assessed as protein dimer-DNA complex formation using F-metC operator DNA by fluorescence anisotropy
In DepthDetails ArticlePubMed