BDBM50362508 CHEMBL1940976
SMILES C[C@H]1COc2c(NCCNc3ccccn3)c(F)c(N)c3c2n1cc(C#N)c3=O
InChI Key InChIKey=IUUGIOMYSFREGO-NSHDSACASA-N
Data  1 IC50
  Tab Delimited (TSV)   2D SDfile   Computed 3D by Vconf -m prep SDfile
Find this compound or compounds like it in BindingDB:
Activity Spreadsheet -- Enzyme Inhibition Constant Data from BindingDB
Found 1 hit for monomerid = 50362508
TargetGlycogen synthase kinase-3 beta(Homo sapiens (Human))
Activx Biosciences
Curated by ChEMBL
LigandPNGBDBM50362508(CHEMBL1940976)
Affinity DataIC50:  0.570nM. Assay description: Inhibition of GSK3-beta
In DepthDetails ArticlePubMed