BDBM50362522 CHEMBL1940990
SMILES C[C@H]1COc2c(NCCCc3ccccn3)c(F)c(N)c3c2n1cc(C#N)c3=O
InChI Key InChIKey=ZGPDFKYQHBHSHB-LBPRGKRZSA-N
Data  1 IC50
  Tab Delimited (TSV)   2D SDfile   Computed 3D by Vconf -m prep SDfile
Find this compound or compounds like it in BindingDB:
Activity Spreadsheet -- Enzyme Inhibition Constant Data from BindingDB
Found 1 hit for monomerid = 50362522
TargetGlycogen synthase kinase-3 beta(Homo sapiens (Human))
Activx Biosciences
Curated by ChEMBL
LigandPNGBDBM50362522(CHEMBL1940990)
Affinity DataIC50:  0.600nM. Assay description: Inhibition of GSK3-beta
In DepthDetails ArticlePubMed