BDBM50362687 CHEMBL1939474
SMILES CC(Sc1nnc(-c2ccc(NC(=O)c3ccc(C)cc3)cc2)n1C)C(O)=O
InChI Key InChIKey=UQXUOPDOOLWWND-UHFFFAOYSA-N
Data  2 IC50
  Tab Delimited (TSV)   2D SDfile   Computed 3D by Vconf -m prep SDfile
Find this compound or compounds like it in BindingDB:
Activity Spreadsheet -- Enzyme Inhibition Constant Data from BindingDB
Found 2 hits for monomerid = 50362687
TargetDiacylglycerol O-acyltransferase 1(Homo sapiens (Human))
Prosidion
Curated by ChEMBL
LigandPNGBDBM50362687(CHEMBL1939474)
Affinity DataIC50:  130nM. Assay description: Inhibition of human recombinant N-terminus FLAG-tagged DGAT1 expressed in baculovirus infected insect Sf9 cells assessed as triglyceride synthesis
In DepthDetails ArticlePubMed
TargetDiacylglycerol O-acyltransferase 1(Mus musculus (mouse))
Prosidion
Curated by ChEMBL
LigandPNGBDBM50362687(CHEMBL1939474)
Affinity DataIC50: >2.00E+4nM. Assay description: Inhibition of DGAT1-mediated triglyceride synthesis n mouse 3T3L1 cells
In DepthDetails ArticlePubMed