BDBM50362691 CHEMBL1939637
SMILES COc1ccc(COc2ccc(CCC(O)=O)cc2)cc1
InChI Key InChIKey=QXHJAIWJXTWLDT-UHFFFAOYSA-N
Data  1 EC50
  Tab Delimited (TSV)   2D SDfile   Computed 3D by Vconf -m prep SDfile
Find this compound or compounds like it in BindingDB:
Activity Spreadsheet -- Enzyme Inhibition Constant Data from BindingDB
Found 1 hit for monomerid = 50362691
TargetFree fatty acid receptor 1(Homo sapiens (Human))
Amgen
Curated by ChEMBL
LigandPNGBDBM50362691(CHEMBL1939637)
Affinity DataEC50:  1.10E+3nM. Assay description: Agonist activity at human GPR40 expressed in CHO cells assessed as calcium flux measured for 20 secs by aequorin assay
In DepthDetails ArticlePubMed