BDBM50362705 CHEMBL1939651
SMILES CC#CC(CC(O)=O)c1ccc(OCc2ccc(cc2)-c2ccccc2)cc1
InChI Key InChIKey=SVSDEDUBFFMJKW-UHFFFAOYSA-N
Data  2 EC50
  Tab Delimited (TSV)   2D SDfile   Computed 3D by Vconf -m prep SDfile
Find this compound or compounds like it in BindingDB:
Activity Spreadsheet -- Enzyme Inhibition Constant Data from BindingDB
Found 2 hits for monomerid = 50362705
TargetFree fatty acid receptor 1(Homo sapiens (Human))
TBA
Curated by ChEMBL
LigandPNGBDBM50362705(CHEMBL1939651)
Affinity DataEC50:  7.70E+3nM. Assay description: Agonist activity at GPR40 expressed in CHO cells after 20 seconds by aequorin bioluminescence assay in presence of 0.1 % human serum
In DepthDetails ArticlePubMed
TargetFree fatty acid receptor 1(Homo sapiens (Human))
TBA
Curated by ChEMBL
LigandPNGBDBM50362705(CHEMBL1939651)
Affinity DataEC50:  1.20E+3nM. Assay description: Agonist activity at human GPR40 expressed in CHO cells assessed as calcium flux measured for 20 secs by aequorin assay
In DepthDetails ArticlePubMed