BDBM50362706 CHEMBL1939652
SMILES CC#CC(CC(O)=O)c1ccc(OCc2ccccc2-c2ccccc2)cc1
InChI Key InChIKey=RLQJGINCIVPNFB-UHFFFAOYSA-N
Data  1 EC50
  Tab Delimited (TSV)   2D SDfile   Computed 3D by Vconf -m prep SDfile
Find this compound or compounds like it in BindingDB:
Activity Spreadsheet -- Enzyme Inhibition Constant Data from BindingDB
Found 1 hit for monomerid = 50362706
TargetFree fatty acid receptor 1(Homo sapiens (Human))
Amgen
Curated by ChEMBL
LigandPNGBDBM50362706(CHEMBL1939652)
Affinity DataEC50:  240nM. Assay description: Agonist activity at human GPR40 expressed in CHO cells assessed as calcium flux measured for 20 secs by aequorin assay
In DepthDetails ArticlePubMed