BDBM50362749 CHEMBL1939985
SMILES O=C1C2[C@@H](NC(=S)N=C2c2ccccc12)c1ccccc1
InChI Key InChIKey=ORDBGAKTGTYTFW-KZUDCZAMSA-N
Data  2 IC50
  Tab Delimited (TSV)   2D SDfile   Computed 3D by Vconf -m prep SDfile
Find this compound or compounds like it in BindingDB:
Activity Spreadsheet -- Enzyme Inhibition Constant Data from BindingDB
Found 2 hits for monomerid = 50362749
TargetTransient receptor potential cation channel subfamily A member 1(Rattus norvegicus)
Janssen Pharmaceutica
Curated by ChEMBL
LigandPNGBDBM50362749(CHEMBL1939985)
Affinity DataIC50: >1.00E+4nM. Assay description: Antagonist activity at rat TRPA1 expressed in HEK293 cells assessed as inhibition of BITC-induced increase in intracellular calcium concentration by ...
In DepthDetails ArticlePubMed
TargetTransient receptor potential cation channel subfamily A member 1(Homo sapiens (Human))
Janssen Pharmaceutica
Curated by ChEMBL
LigandPNGBDBM50362749(CHEMBL1939985)
Affinity DataIC50:  8.10E+3nM. Assay description: Antagonist activity at human TRPA1 expressed in HEK293 cells assessed as inhibition of 5H-dibenzo[b,e]azepine-10-carboxylic acid methyl ester-induced...
In DepthDetails ArticlePubMed