BDBM50362894 CHEMBL1946749
SMILES OC(=O)Cc1c(-c2ccccc2)n(C(=O)c2ccc(Cl)cc2)c2ccccc12
InChI Key InChIKey=CTOLGLQYKWARIE-UHFFFAOYSA-N
Data  4 IC50
  Tab Delimited (TSV)   2D SDfile   Computed 3D by Vconf -m prep SDfile
Find this compound or compounds like it in BindingDB:
Activity Spreadsheet -- Enzyme Inhibition Constant Data from BindingDB
Found 4 hits for monomerid = 50362894
TargetProstaglandin G/H synthase 1(Homo sapiens (Human))
TBA
Curated by ChEMBL
LigandPNGBDBM50362894(CHEMBL1946749)
Affinity DataIC50: >4.00E+5nM. Assay description: Inhibition of COX1
In DepthDetails ArticlePubMed
TargetProstaglandin G/H synthase 1(Ovis aries (Sheep))
Hokkaido University
Curated by ChEMBL
LigandPNGBDBM50362894(CHEMBL1946749)
Affinity DataIC50: >4.00E+5nM. Assay description: Inhibition of ovine COX1 by colorimetric assay
In DepthDetails ArticlePubMed
TargetProstaglandin G/H synthase 2(Ovis aries (Sheep))
Hokkaido University
Curated by ChEMBL
LigandPNGBDBM50362894(CHEMBL1946749)
Affinity DataIC50: >4.00E+5nM. Assay description: Inhibition of ovine COX2 by colorimetric assay
In DepthDetails ArticlePubMed
TargetProstaglandin G/H synthase 2(Homo sapiens (Human))
TBA
Curated by ChEMBL
LigandPNGBDBM50362894(CHEMBL1946749)
Affinity DataIC50: >4.00E+5nM. Assay description: Inhibition of COX2
In DepthDetails ArticlePubMed