BDBM50364570 CHEMBL1951140
SMILES CCCCc1nc(C)c(CCC(=O)N2CCCC2)c(=O)n1Cc1ccc(cc1)-c1ccccc1-c1nnn[nH]1
InChI Key InChIKey=XOGWIMHFCUNINQ-UHFFFAOYSA-N
Data  1 IC50
  Tab Delimited (TSV)   2D SDfile   Computed 3D by Vconf -m prep SDfile
Find this compound or compounds like it in BindingDB:
Activity Spreadsheet -- Enzyme Inhibition Constant Data from BindingDB
Found 1 hit for monomerid = 50364570
TargetType-1 angiotensin II receptor(RABBIT)
Kyung Hee University
Curated by ChEMBL
LigandPNGBDBM50364570(CHEMBL1951140)
Affinity DataIC50:  5.86nM. Assay description: Antagonist activity at angiotensin 2 receptor type 1 in New Zealand White rabbit descending thoracic aorta rings assessed as inhibition of angiotensi...
In DepthDetails ArticlePubMed