BDBM50364573 CHEMBL1951143
SMILES CCCCc1nc(C)c(CC(=S)N(C)C)c(=O)n1Cc1ccc(cc1)-c1ccccc1-c1nnn[nH]1
InChI Key InChIKey=AMEROGPZOLAFBN-UHFFFAOYSA-N
Data  2 IC50
  Tab Delimited (TSV)   2D SDfile   Computed 3D by Vconf -m prep SDfile
Find this compound or compounds like it in BindingDB:
Activity Spreadsheet -- Enzyme Inhibition Constant Data from BindingDB
Found 2 hits for monomerid = 50364573
TargetType-1 angiotensin II receptor(Homo sapiens (Human))
Boryung Pharmaceuticals
Curated by ChEMBL
LigandPNGBDBM50364573(CHEMBL1951143)
Affinity DataIC50:  4.5nM. Assay description: Antagonist activity at type-1 angiotensin 2 receptor (unknown origin) by calcium mobilizing assay
In DepthDetails ArticlePubMed
TargetType-1 angiotensin II receptor(RABBIT)
Kyung Hee University
Curated by ChEMBL
LigandPNGBDBM50364573(CHEMBL1951143)
Affinity DataIC50:  0.420nM. Assay description: Antagonist activity at angiotensin 2 receptor type 1 in New Zealand White rabbit descending thoracic aorta rings assessed as inhibition of angiotensi...
In DepthDetails ArticlePubMed