BDBM50365294 CHEMBL1955895
SMILES Cn1ncc2ccc(cc12)C(=O)N1CCC2(CC1)CC(=O)c1nn(cc1O2)C(C)(C)C
InChI Key InChIKey=GVSOKVAZHFZVIQ-UHFFFAOYSA-N
Data  2 IC50
  Tab Delimited (TSV)   2D SDfile   Computed 3D by Vconf -m prep SDfile
Find this compound or compounds like it in BindingDB:
Activity Spreadsheet -- Enzyme Inhibition Constant Data from BindingDB
Found 2 hits for monomerid = 50365294
TargetAcetyl-CoA carboxylase 2(Homo sapiens (Human))
Pfizer
Curated by ChEMBL
LigandPNGBDBM50365294(CHEMBL1955895)
Affinity DataIC50:  21nM. Assay description: Inhibition of human Acetyl-CoA carboxylase 2 expressed in CHO cells after 1 hr by fluorescence assay
In DepthDetails ArticlePubMed
TargetAcetyl-CoA carboxylase 1(Rattus norvegicus (Rat))
Pfizer
Curated by ChEMBL
LigandPNGBDBM50365294(CHEMBL1955895)
Affinity DataIC50:  13nM. Assay description: Inhibition of rat liver Acetyl-CoA carboxylase 1 using acetyl-CoA as substrate preincubated for 10 mins prior substrate addition measured after 20 mi...
In DepthDetails ArticlePubMed