BDBM50365961 CHEMBL1956232
SMILES CCOC1CCN(CC1)c1ccc(cn1)-c1cnnc2cc(OC)c(OC)cc12
InChI Key InChIKey=YIMICONUAFCICU-UHFFFAOYSA-N
Data  1 IC50
  Tab Delimited (TSV)   2D SDfile   Computed 3D by Vconf -m prep SDfile
Find this compound or compounds like it in BindingDB:
Activity Spreadsheet -- Enzyme Inhibition Constant Data from BindingDB
Found 1 hit for monomerid = 50365961
LigandPNGBDBM50365961(CHEMBL1956232)
Affinity DataIC50:  13nM. Assay description: Inhibition of PDE10A
In DepthDetails ArticlePubMed