BDBM50366566 CHEMBL610071
SMILES OCC(O)[C@H]1OC(=O)[C@H](O)[C@@H]1O
InChI Key InChIKey=SXZYCXMUPBBULW-LQXMCGDCSA-N
Data  1 KI
  Tab Delimited (TSV)   2D SDfile   Computed 3D by Vconf -m prep SDfile
Find this compound or compounds like it in BindingDB:
Activity Spreadsheet -- Enzyme Inhibition Constant Data from BindingDB
Found 1 hit for monomerid = 50366566
TargetBeta-mannosidase(Homo sapiens (Human))
S.E.S.N.A.B., Pole Sciences Et Technologie, Universit�
Curated by ChEMBL
LigandPNGBDBM50366566(CHEMBL610071)
Affinity DataKi:  1.70E+4nM. Assay description: The compound was tested for its inhibitory activity against beta-mannosidase
In DepthDetails ArticlePubMed