BDBM50367008 CHEMBL603761
SMILES Nc1ncnc2n(C3OC(CO[P+](O)(O)[O-])C(O)C3O)c(SCc3cc(cc(c3)[N+]([O-])=O)[N+]([O-])=O)nc12
InChI Key InChIKey=OGVPCEMBXKSGRQ-UHFFFAOYSA-N
Data  1 KI
  Tab Delimited (TSV)   2D SDfile   Computed 3D by Vconf -m prep SDfile
Find this compound or compounds like it in BindingDB:
Activity Spreadsheet -- Enzyme Inhibition Constant Data from BindingDB
Found 1 hit for monomerid = 50367008
TargetInosine-5'-monophosphate dehydrogenase(Escherichia coli (strain K12))
TBA
Curated by ChEMBL
LigandPNGBDBM50367008(CHEMBL603761)
Affinity DataKi:  2.10E+4nM. Assay description: Inhibition of inosine monophosphate dehydrogenase in Escherichia coli
In DepthDetails ArticlePubMed