BDBM50367015 CHEMBL606058
SMILES O[C@@H]1[C@@H](COP(O)(O)=O)OC([C@@H]1O)n1c(SCc2ccccc2)nc2c1nc[nH]c2=O
InChI Key InChIKey=JUSWVPKXCFKXRW-AARXTDBFSA-N
Data  1 KI
  Tab Delimited (TSV)   2D SDfile   Computed 3D by Vconf -m prep SDfile
Find this compound or compounds like it in BindingDB:
Activity Spreadsheet -- Enzyme Inhibition Constant Data from BindingDB
Found 1 hit for monomerid = 50367015
TargetInosine-5'-monophosphate dehydrogenase(Escherichia coli (strain K12))
TBA
Curated by ChEMBL
LigandPNGBDBM50367015(CHEMBL606058)
Affinity DataKi:  4.60E+4nM. Assay description: Inhibition of inosine monophosphate dehydrogenase in Escherichia coli
In DepthDetails ArticlePubMed