BDBM50367411 CHEMBL610070
SMILES OC[C@H]1OC([C@H](O)[C@@H]1O)n1cnc2c(NCCCC(c3ccccc3)c3ccccc3)ncnc12
InChI Key InChIKey=JTYXAUTVTBTIHT-CUVLRLMBSA-N
Data  2 KI
  Tab Delimited (TSV)   2D SDfile   Computed 3D by Vconf -m prep SDfile
Find this compound or compounds like it in BindingDB:
Activity Spreadsheet -- Enzyme Inhibition Constant Data from BindingDB
Found 2 hits for monomerid = 50367411
TargetAdenosine receptor A1(Rattus norvegicus (rat))
Parke-Davis Pharmaceutical Research Division
Curated by ChEMBL
LigandPNGBDBM50367411(CHEMBL610070)
Affinity DataKi:  290nM. Assay description: Binding affinity to adenosine A1 receptor in rat whole brain membranes by [3H]N6-cyclohexyladenosine displacement.
In DepthDetails ArticlePubMed
TargetAdenosine receptor A2a/A2b(Rattus norvegicus)
Parke-Davis Pharmaceutical Research Division
Curated by ChEMBL
LigandPNGBDBM50367411(CHEMBL610070)
Affinity DataKi:  4.70E+3nM. Assay description: Binding affinity to A2 adenosine receptor in rat striatal membranes by [3H]NECA (1-(6-amino-9H-purin-9-yl)-1-deoxy-N-ethyl-beta-D-ribofuranuronamide)...
In DepthDetails ArticlePubMed