BDBM50368578 CHEMBL605856
SMILES OC[C@H]1OC([C@H](O)[C@@H]1O)n1cnc2c(NC(C3CC3)C3CC3)ncnc12
InChI Key InChIKey=RAVOWCMWQXNPDU-NVONZOAYSA-N
Data  1 KI
  Tab Delimited (TSV)   2D SDfile   Computed 3D by Vconf -m prep SDfile
Find this compound or compounds like it in BindingDB:
Activity Spreadsheet -- Enzyme Inhibition Constant Data from BindingDB
Found 1 hit for monomerid = 50368578
TargetAdenosine receptor A1(GUINEA PIG)
Kyowa Hakko Kogyo
Curated by ChEMBL
LigandPNGBDBM50368578(CHEMBL605856)
Affinity DataKi:  0.75nM. Assay description: Inhibition of N6-[3H]cyclohexyladenosine binding to guinea pig forebrain membrane Adenosine A1 receptor
In DepthDetails ArticlePubMed