BDBM50369009 CHEMBL241993
SMILES Cc1cc2[C@H]3CC[C@]4(C)[C@@H](O)CC[C@H]4[C@@H]3CCc2cc1O
InChI Key InChIKey=PAZNMSHBVDFVSA-NNYOOSKESA-N
Data  1 KI  1 IC50
  Tab Delimited (TSV)   2D SDfile   Computed 3D by Vconf -m prep SDfile
Find this compound or compounds like it in BindingDB:
Activity Spreadsheet -- Enzyme Inhibition Constant Data from BindingDB
Found 2 hits for monomerid = 50369009
TargetAromatase(Homo sapiens (Human))
The M. S. University Of Baroda
Curated by ChEMBL
LigandPNGBDBM50369009(CHEMBL241993)
Affinity DataKi:  100nM. Assay description: Competitive inhibition of human aromatase extracted from placental microsomes after 5 mins by Dixon plot analysis in presence of [1beta-3H]AD
In DepthDetails ArticlePubMed
TargetTubulin beta-2B chain(Bos taurus)
Purdue University
Curated by ChEMBL
LigandPNGBDBM50369009(CHEMBL241993)
Affinity DataIC50:  1.70E+4nM. Assay description: In vitro inhibition of tubulin polymerization.
In DepthDetails ArticlePubMed