BDBM50369062 CHEMBL611298
SMILES CNc1ccnc2n(cnc12)C1O[C@H](CO)[C@@H](O)[C@H]1O
InChI Key InChIKey=FALQWUQHNPVZOK-IYYKZFDCSA-N
Data  1 KI
  Tab Delimited (TSV)   2D SDfile   Computed 3D by Vconf -m prep SDfile
Find this compound or compounds like it in BindingDB:
Activity Spreadsheet -- Enzyme Inhibition Constant Data from BindingDB
Found 1 hit for monomerid = 50369062
TargetAdenosine deaminase(Bos taurus (bovine))
Universit£
Curated by ChEMBL
LigandPNGBDBM50369062(CHEMBL611298)
Affinity DataKi:  1.20E+4nM. Assay description: Inhibition calf intestine adenosine deaminase
In DepthDetails ArticlePubMed