BDBM50369302 CHEMBL1204424
SMILES COC(=O)[C@H](Cc1ccccc1)NC(=O)[C@@H](N)CCCN=C(N)N[N+]([O-])=O
InChI Key InChIKey=KYHOHJBCGGKDLL-STQMWFEESA-N
Data  3 KI
  Tab Delimited (TSV)   2D SDfile   Computed 3D by Vconf -m prep SDfile
Find this compound or compounds like it in BindingDB:
Activity Spreadsheet -- Enzyme Inhibition Constant Data from BindingDB
Found 3 hits for monomerid = 50369302
TargetNitric oxide synthase, brain(Homo sapiens (Human))
Northwestern University
Curated by ChEMBL
LigandPNGBDBM50369302(CHEMBL1204424)
Affinity DataKi:  2.90E+5nM. Assay description: Inhibition of Neuronal Nitric oxide synthase enzyme (nNOS)
In DepthDetails ArticlePubMed
TargetNitric oxide synthase, endothelial(Bos taurus (bovine))
Northwestern University
Curated by ChEMBL
LigandPNGBDBM50369302(CHEMBL1204424)
Affinity DataKi:  1.40E+6nM. Assay description: Inhibition of endothelial isoform of nitric oxide synthase
In DepthDetails ArticlePubMed
TargetNitric oxide synthase, inducible(Mus musculus (mouse))
Northwestern University
Curated by ChEMBL
LigandPNGBDBM50369302(CHEMBL1204424)
Affinity DataKi:  6.40E+6nM. Assay description: Inhibition of inducible Nitric Oxide Synthase
In DepthDetails ArticlePubMed