BDBM50369307 CHEMBL1202109
SMILES COC(=O)[C@H](CCCN=C(N)N[N+]([O-])=O)NC(=O)[C@@H](N)Cc1ccccc1
InChI Key InChIKey=DRSRVBDYFUDJCK-STQMWFEESA-N
Data  3 KI
  Tab Delimited (TSV)   2D SDfile   Computed 3D by Vconf -m prep SDfile
Find this compound or compounds like it in BindingDB:
Activity Spreadsheet -- Enzyme Inhibition Constant Data from BindingDB
Found 3 hits for monomerid = 50369307
TargetNitric oxide synthase, inducible(Mus musculus (mouse))
Northwestern University
Curated by ChEMBL
LigandPNGBDBM50369307(CHEMBL1202109)
Affinity DataKi:  2.04E+5nM. Assay description: Inhibition of inducible Nitric Oxide Synthase
In DepthDetails ArticlePubMed
TargetNitric oxide synthase, brain(Homo sapiens (Human))
Northwestern University
Curated by ChEMBL
LigandPNGBDBM50369307(CHEMBL1202109)
Affinity DataKi:  3.70E+5nM. Assay description: Inhibition of Neuronal Nitric oxide synthase enzyme (nNOS)
In DepthDetails ArticlePubMed
TargetNitric oxide synthase, endothelial(Bos taurus (bovine))
Northwestern University
Curated by ChEMBL
LigandPNGBDBM50369307(CHEMBL1202109)
Affinity DataKi:  1.35E+6nM. Assay description: Inhibition of endothelial isoform of nitric oxide synthase
In DepthDetails ArticlePubMed