BDBM50369957 CHEMBL1790864
SMILES COC1=C(OC)\C(OC1=O)=C\COP(O)(=O)OC[C@H]1O[C@H]([C@H](O)[C@@H]1OP(O)(=O)COCCn1cnc2ncnc(N)c12)n1cnc2c(N)ncnc12
InChI Key InChIKey=HRNZSLZWPJVLQM-QLRQENLLSA-N
Data  1 KI
  Tab Delimited (TSV)   2D SDfile   Computed 3D by Vconf -m prep SDfile
Find this compound or compounds like it in BindingDB:
Activity Spreadsheet -- Enzyme Inhibition Constant Data from BindingDB
Found 1 hit for monomerid = 50369957
TargetAdenosine deaminase(Bos taurus (bovine))
Academia Sinica
Curated by ChEMBL
LigandPNGBDBM50369957(CHEMBL1790864)
Affinity DataKi: >8.00E+5nM. Assay description: Inhibitory activity against adenosine deaminase
In DepthDetails ArticlePubMed