BDBM50370109 CHEMBL1790723
SMILES [#6]-[#6]-[#6@@H](-[#6])-[#6@H]-1-[#7]-[#6](=O)-[#6@@H](-[#7]-[#6](=O)-[#6](-[#8])-[#6]-[#16]-[#16]-[#6]-[#6@@H](-[#7]-[#6](=O)-[#6@@H](-[#6]-[#6](-[#7])=O)-[#7]-[#6](=O)-[#6@@H](-[#6]-[#6]-[#6](-[#7])=O)-[#7]-[#6]-1=O)-[#6](=O)-[#7]-1-[#6]-[#6]-[#6]-[#6@@H]-1-[#6](=O)-[#7]-[#6@@H](-[#6]-[#6]-[#6]-[#7]-[#6](=O)-c1ccc(-[#6]-2=[#6]-3-[#6]=[#6]-[#6](=[#6]-[#6]-3-[#8]-[#6]-3=[#6]\[#6](-[#6]=[#6]-[#6]-2-3)=[#7+](\[#6])-[#6])-[#7](-[#6])-[#6])c(c1)-[#6](-[#8])=O)-[#6](=O)-[#7]-[#6]-[#7])-c1ccc(-[#8])cc1
InChI Key InChIKey=XSTBAVMTSHGRBE-CMUMJJDBSA-O
Data  2 KI
  Tab Delimited (TSV)   2D SDfile   Computed 3D by Vconf -m prep SDfile
Find this compound or compounds like it in BindingDB:
Activity Spreadsheet -- Enzyme Inhibition Constant Data from BindingDB
Found 2 hits for monomerid = 50370109
TargetOxytocin receptor(Homo sapiens (Human))
University Of Montpellier
Curated by ChEMBL
LigandPNGBDBM50370109(CHEMBL1790723)
Affinity DataKi:  0.0900nM. Assay description: Binding affinity for human oxytocin receptor
In DepthDetails ArticlePubMed
TargetVasopressin V1a receptor(Homo sapiens (Human))
University Of Montpellier
Curated by ChEMBL
LigandPNGBDBM50370109(CHEMBL1790723)
Affinity DataKi:  7.60nM. Assay description: Binding affinity for human Vasopressin V1a receptor
In DepthDetails ArticlePubMed