BDBM50371233 CHEMBL3347571
SMILES CCC[C@@H]1OC(=O)C(=C)[C@H]1C(O)=O
InChI Key InChIKey=SRQUTZJZABSZRQ-NKWVEPMBSA-N
Data  1 IC50
  Tab Delimited (TSV)   2D SDfile   Computed 3D by Vconf -m prep SDfile
Find this compound or compounds like it in BindingDB:
Activity Spreadsheet -- Enzyme Inhibition Constant Data from BindingDB
Found 1 hit for monomerid = 50371233
TargetHistone acetyltransferase KAT2A(Homo sapiens (Human))
Shanghai University
Curated by ChEMBL
LigandPNGBDBM50371233(CHEMBL3347571)
Affinity DataIC50:  1.00E+5nM. Assay description: Inhibition of GCN5 (unknown origin)
In DepthDetails ArticlePubMed