BDBM50373048 CHEMBL184106
SMILES CCCCCS(=O)(=O)NC1CCOC1=O
InChI Key InChIKey=NLUZYZHJZKPTKC-UHFFFAOYSA-N
Data  2 IC50
  Tab Delimited (TSV)   2D SDfile   Computed 3D by Vconf -m prep SDfile
Find this compound or compounds like it in BindingDB:
Activity Spreadsheet -- Enzyme Inhibition Constant Data from BindingDB
Found 2 hits for monomerid = 50373048
TargetTranscriptional activator protein LuxR(Vibrio fischeri)
Larkin University
Curated by ChEMBL
LigandPNGBDBM50373048(CHEMBL184106)
Affinity DataIC50:  2.00E+3nM. Assay description: Antagonist activity at Aliivibrio fischeri LuxR by luminescence method
In DepthDetails ArticlePubMed
TargetTranscriptional activator protein LuxR(Vibrio fischeri)
Larkin University
Curated by ChEMBL
LigandPNGBDBM50373048(CHEMBL184106)
Affinity DataIC50:  3.00E+3nM. Assay description: Antagonist activity at LuxR in Vibrio fischeri assessed as inhibition of N-3-oxos-hexanoyl-L-homoserine lactone induced luminescence
In DepthDetails ArticlePubMed